Reaction Details
TargetGlycogen synthase kinase-3 beta
LigandBDBM50147471
Substrate/Competitorn/a
Meas. Tech.ChEBML_71154
IC50 31±n/a nM
Citation Zhang, HCYe, HConway, BRDerian, CKAddo, MFKuo, GHHecker, LRCroll, DRLi, JWestover, LXu, JZLook, RDemarest, KTAndrade-Gordon, PDamiano, BPMaryanoff, BE 3-(7-Azaindolyl)-4-arylmaleimides as potent, selective inhibitors of glycogen synthase kinase-3. Bioorg Med Chem Lett14:3245-50 (2004) 
 
Glycogen synthase kinase-3 beta
Name:Glycogen synthase kinase-3 beta
Type:Enzyme
Mol. Mass.:46756.38
Organism:Homo sapiens (Human)
Description:P49841
Residue:420
BDBM50147471
NameBDBM50147471
Synonyms:3-[1-(3-Hydroxy-propyl)-1H-pyrrolo[2,3-b]pyridin-3-yl]-4-thiophen-2-yl-pyrrole-2,5-dione | CHEMBL333829
TypeSmall organic molecule
Emp. Form.C18H15N3O3S
Mol. Mass.353.395
SMILESOCCCn1cc(C2=C(C(=O)NC2=O)c2cccs2)c2cccnc12