Reaction Details
TargetGlycogen synthase kinase-3 beta
LigandBDBM50147459
Substrate/Competitorn/a
Meas. Tech.ChEBML_71154
IC50 14±n/a nM
Citation Zhang, HCYe, HConway, BRDerian, CKAddo, MFKuo, GHHecker, LRCroll, DRLi, JWestover, LXu, JZLook, RDemarest, KTAndrade-Gordon, PDamiano, BPMaryanoff, BE 3-(7-Azaindolyl)-4-arylmaleimides as potent, selective inhibitors of glycogen synthase kinase-3. Bioorg Med Chem Lett14:3245-50 (2004) 
 
Glycogen synthase kinase-3 beta
Name:Glycogen synthase kinase-3 beta
Type:Enzyme
Mol. Mass.:46756.38
Organism:Homo sapiens (Human)
Description:P49841
Residue:420
BDBM50147459
NameBDBM50147459
Synonyms:CHEMBL326208 | N-(3-{3-[4-(2-Methoxy-phenyl)-2,5-dioxo-2,5-dihydro-1H-pyrrol-3-yl]-pyrrolo[2,3-b]pyridin-1-yl}-propyl)-methanesulfonamide
TypeSmall organic molecule
Emp. Form.C22H22N4O5S
Mol. Mass.454.499
SMILESCOc1ccccc1C1=C(C(=O)NC1=O)c1cn(CCCNS(C)(=O)=O)c2ncccc12