Reaction Details
TargetRibosomal protein S6 kinase alpha-3
LigandBDBM50147457
Substrate/Competitorn/a
Meas. Tech.ChEBML_195551
IC50 2000±n/a nM
Citation Zhang, HCYe, HConway, BRDerian, CKAddo, MFKuo, GHHecker, LRCroll, DRLi, JWestover, LXu, JZLook, RDemarest, KTAndrade-Gordon, PDamiano, BPMaryanoff, BE 3-(7-Azaindolyl)-4-arylmaleimides as potent, selective inhibitors of glycogen synthase kinase-3. Bioorg Med Chem Lett14:3245-50 (2004) 
 
Ribosomal protein S6 kinase alpha-3
Name:Ribosomal protein S6 kinase alpha-3
Type:Serine/threonine-protein kinase
Mol. Mass.:83740.03
Organism:Homo sapiens (Human)
Description:The human RSK2 sequence differed from the Genbank entry NM_004586 at one residue, V45G. The protein was cloned and purified from baculovirus expression system.
Residue:740
BDBM50147457
NameBDBM50147457
Synonyms:3-(2-Hydroxy-phenyl)-4-[1-(3-hydroxy-propyl)-1H-pyrrolo[2,3-b]pyridin-3-yl]-pyrrole-2,5-dione | CHEMBL109944
TypeSmall organic molecule
Emp. Form.C21H19N3O4
Mol. Mass.377.3933
SMILESCOCCCn1cc(C2=C(C(=O)NC2=O)c2ccccc2O)c2cccnc12