Reaction Details
TargetSphingosine 1-phosphate receptor 4
LigandBDBM50147705
Substrate/Competitorn/a
Meas. Tech.ChEMBL_201335 (CHEMBL806184)
IC50>10000±n/a nM
Citation Hale, JJNeway, WMills, SGHajdu, RAnn Keohane, CRosenbach, MMilligan, JShei, GJChrebet, GBergstrom, JCard, DKoo, GCKoprak, SLJackson, JJRosen, HMandala, S Potent S1P receptor agonists replicate the pharmacologic actions of the novel immune modulator FTY720. Bioorg Med Chem Lett14:3351-5 (2004) 
 
Sphingosine 1-phosphate receptor 4
Name:Sphingosine 1-phosphate receptor 4
Type:G Protein-Coupled Receptor (GPCR)
Mol. Mass.:41647.39
Organism:Homo sapiens (Human)
Description:n/a
Residue:384
BDBM50147705
NameBDBM50147705
Synonyms:3-Amino-5-(4-octyl-phenyl)-pentane-1-sulfonic acid | CHEMBL115131
TypeSmall organic molecule
Emp. Form.C19H33NO3S
Mol. Mass.355.535
SMILESCCCCCCCCc1ccc(CCC(N)CCS(O)(=O)=O)cc1