Reaction Details
TargetSphingosine 1-phosphate receptor 1
LigandBDBM50147714
Substrate/Competitorn/a
Meas. Tech.ChEMBL_201317 (CHEMBL806167)
IC50 0.76±n/a nM
Citation Hale, JJNeway, WMills, SGHajdu, RAnn Keohane, CRosenbach, MMilligan, JShei, GJChrebet, GBergstrom, JCard, DKoo, GCKoprak, SLJackson, JJRosen, HMandala, S Potent S1P receptor agonists replicate the pharmacologic actions of the novel immune modulator FTY720. Bioorg Med Chem Lett14:3351-5 (2004) 
 
Sphingosine 1-phosphate receptor 1
Name:Sphingosine 1-phosphate receptor 1
Type:Enzyme
Mol. Mass.:42836.02
Organism:Homo sapiens (Human)
Description:P21453
Residue:382
BDBM50147714
NameBDBM50147714
Synonyms:CHEMBL432067 | Phosphoric acid mono-[2-amino-4-(4-octyl-phenyl)-butyl] ester
TypeSmall organic molecule
Emp. Form.C18H32NO4P
Mol. Mass.357.4247
SMILESCCCCCCCCc1ccc(CCC(N)COP(O)(O)=O)cc1