Reaction Details
TargetSphingosine 1-phosphate receptor 2
LigandBDBM50147713
Substrate/Competitorn/a
Meas. Tech.ChEMBL_201454 (CHEMBL807599)
IC50 9.8±n/a nM
Citation Hale, JJNeway, WMills, SGHajdu, RAnn Keohane, CRosenbach, MMilligan, JShei, GJChrebet, GBergstrom, JCard, DKoo, GCKoprak, SLJackson, JJRosen, HMandala, S Potent S1P receptor agonists replicate the pharmacologic actions of the novel immune modulator FTY720. Bioorg Med Chem Lett14:3351-5 (2004) 
 
Sphingosine 1-phosphate receptor 2
Name:Sphingosine 1-phosphate receptor 2
Type:G Protein-Coupled Receptor (GPCR)
Mol. Mass.:38883.16
Organism:Homo sapiens (Human)
Description:Membranes isolated from S1P2-transfected CHO cells were used in ligand binding assay.
Residue:353
BDBM50147713
NameBDBM50147713
Synonyms:CHEMBL113344 | [3-Amino-1-hydroxy-5-(4-octyl-phenyl)-pentyl]-phosphonic acid
TypeSmall organic molecule
Emp. Form.C19H34NO4P
Mol. Mass.371.4513
SMILESCCCCCCCCc1ccc(CCC(N)CC(=O)P(O)(O)O)cc1