Reaction Details
TargetNitric oxide synthase, inducible
LigandBDBM50124535
Substrate/Competitorn/a
Meas. Tech.ChEMBL_89199 (CHEMBL701150)
IC50 37±n/a nM
Citation Connolly, SAberg, AArvai, ABeaton, HGCheshire, DRCook, ARCooper, SCox, DHamley, PMallinder, PMillichip, INicholls, DJRosenfeld, RJSt-Gallay, SATainer, JTinker, ACWallace, AV 2-aminopyridines as highly selective inducible nitric oxide synthase inhibitors. Differential binding modes dependent on nitrogen substitution. J Med Chem47:3320-3 (2004) 
 
Nitric oxide synthase, inducible
Name:Nitric oxide synthase, inducible
Type:Homodimer
Mol. Mass.:131141.95
Organism:Homo sapiens (Human)
Description:P35228
Residue:1153
BDBM50124535
NameBDBM50124535
Synonyms:1-(6-CYANO-3-PYRIDYLCARBONYL)-5',8'-DIFLUOROSPIRO[PIPERIDINE-4,2'(1'H)-QUINAZOLINE]-4'-AMINE 5-(4-Amino-5,8-difluorospiro[1H-quinazoline-2,4'-piperidine]-1'-carbonyl)pyridine-2-carbonitrile, 3 5-[4'-amino-5',8'-difluorospiro[hexahydropyridine-4,2'-(1',2'-dihydroquinazoline)]-1-ylcarbonyl]-2-pyridinecarbonitrile CHEMBL447183
TypeSmall organic molecule
Emp. Form.C19H16F2N6O
Mol. Mass.382.3667
SMILESNC1=NC2(CCN(CC2)C(=O)c2ccc(nc2)C#N)Nc2c(F)ccc(F)c12