Reaction Details
TargetBeta-3 adrenergic receptor
LigandBDBM50148487
Substrate/Competitorn/a
Meas. Tech.ChEBML_39051
Ki 11±n/a nM
Citation Washburn, WNSun, CQBisacchi, GWu, GCheng, PTSher, PMRyono, DGavai, AVPoss, KGirotra, RNMcCann, PJMikkilineni, ABDejneka, TCWang, TCMerchant, ZMorella, MArbeeny, CMHarper, TWSlusarchyk, DASkwish, SRussell, ADAllen, GTTesfamariam, BFrohlich, BHAbboa-Offei, BECap, MWaldron, TLGeorge, RJYoung, DDickinson, KESeymour, AA BMS-201620: a selective beta 3 agonist. Bioorg Med Chem Lett14:3525-9 (2004) 
 
Beta-3 adrenergic receptor
Name:Beta-3 adrenergic receptor
Type:G Protein-Coupled Receptor (GPCR)
Mol. Mass.:43534.88
Organism:Homo sapiens (Human)
Description:n/a
Residue:408
BDBM50148487
NameBDBM50148487
Synonyms:(S)-2-[2-Hydroxy-2-((R)-4-hydroxy-3-methanesulfonylamino-phenyl)-ethylamino]-2-(4-methoxy-phenyl)-N-(2-methyl-benzothiazol-5-yl)-propionamide | CHEMBL332529
TypeSmall organic molecule
Emp. Form.C27H30N4O6S2
Mol. Mass.570.68
SMILESCOc1ccc(cc1)[C@](C)(NC[C@H](O)c1ccc(O)c(NS(C)(=O)=O)c1)C(=O)Nc1ccc2sc(C)nc2c1