Reaction Details
TargetBeta-3 adrenergic receptor
LigandBDBM50148504
Substrate/Competitorn/a
Meas. Tech.ChEBML_39051
Ki 20±n/a nM
Citation Washburn, WNSun, CQBisacchi, GWu, GCheng, PTSher, PMRyono, DGavai, AVPoss, KGirotra, RNMcCann, PJMikkilineni, ABDejneka, TCWang, TCMerchant, ZMorella, MArbeeny, CMHarper, TWSlusarchyk, DASkwish, SRussell, ADAllen, GTTesfamariam, BFrohlich, BHAbboa-Offei, BECap, MWaldron, TLGeorge, RJYoung, DDickinson, KESeymour, AA BMS-201620: a selective beta 3 agonist. Bioorg Med Chem Lett14:3525-9 (2004) 
 
Beta-3 adrenergic receptor
Name:Beta-3 adrenergic receptor
Type:G Protein-Coupled Receptor (GPCR)
Mol. Mass.:43534.88
Organism:Homo sapiens (Human)
Description:n/a
Residue:408
BDBM50148504
NameBDBM50148504
Synonyms:4-[(S)-2-[2-Hydroxy-2-((R)-4-hydroxy-3-methanesulfonylamino-phenyl)-ethylamino]-2-(4-methoxy-phenyl)-propionylamino]-N-propyl-benzamide | CHEMBL326820
TypeSmall organic molecule
Emp. Form.C29H36N4O7S
Mol. Mass.584.684
SMILESCCCNC(=O)c1ccc(NC(=O)[C@@](C)(NC[C@H](O)c2ccc(O)c(NS(C)(=O)=O)c2)c2ccc(OC)cc2)cc1