Reaction Details
TargetBeta-3 adrenergic receptor
LigandBDBM50148518
Substrate/Competitorn/a
Meas. Tech.ChEBML_39051
Ki 93±n/a nM
Citation Washburn, WNSun, CQBisacchi, GWu, GCheng, PTSher, PMRyono, DGavai, AVPoss, KGirotra, RNMcCann, PJMikkilineni, ABDejneka, TCWang, TCMerchant, ZMorella, MArbeeny, CMHarper, TWSlusarchyk, DASkwish, SRussell, ADAllen, GTTesfamariam, BFrohlich, BHAbboa-Offei, BECap, MWaldron, TLGeorge, RJYoung, DDickinson, KESeymour, AA BMS-201620: a selective beta 3 agonist. Bioorg Med Chem Lett14:3525-9 (2004) 
 
Beta-3 adrenergic receptor
Name:Beta-3 adrenergic receptor
Type:G Protein-Coupled Receptor (GPCR)
Mol. Mass.:43534.88
Organism:Homo sapiens (Human)
Description:n/a
Residue:408
BDBM50148518
NameBDBM50148518
Synonyms:CHEMBL325425 | {4-[(S)-2-[2-Hydroxy-2-((R)-4-hydroxy-3-methanesulfonylamino-phenyl)-ethylamino]-2-(4-methoxy-phenyl)-propionylamino]-benzyl}-phosphonic acid diethyl ester
TypeSmall organic molecule
Emp. Form.C30H40N3O9PS
Mol. Mass.649.692
SMILESCCOP(=O)(Cc1ccc(NC(=O)[C@@](C)(NC[C@H](O)c2ccc(O)c(NS(C)(=O)=O)c2)c2ccc(OC)cc2)cc1)OCC