Reaction Details
TargetBeta-3 adrenergic receptor
LigandBDBM50148517
Substrate/Competitorn/a
Meas. Tech.ChEBML_39051
Ki 260±n/a nM
Citation Washburn, WNSun, CQBisacchi, GWu, GCheng, PTSher, PMRyono, DGavai, AVPoss, KGirotra, RNMcCann, PJMikkilineni, ABDejneka, TCWang, TCMerchant, ZMorella, MArbeeny, CMHarper, TWSlusarchyk, DASkwish, SRussell, ADAllen, GTTesfamariam, BFrohlich, BHAbboa-Offei, BECap, MWaldron, TLGeorge, RJYoung, DDickinson, KESeymour, AA BMS-201620: a selective beta 3 agonist. Bioorg Med Chem Lett14:3525-9 (2004) 
 
Beta-3 adrenergic receptor
Name:Beta-3 adrenergic receptor
Type:G Protein-Coupled Receptor (GPCR)
Mol. Mass.:43534.88
Organism:Homo sapiens (Human)
Description:n/a
Residue:408
BDBM50148517
NameBDBM50148517
Synonyms:(S)-N-[4-(2-Dimethylamino-ethoxy)-phenyl]-2-[(R)-2-hydroxy-2-(4-hydroxy-3-methanesulfonylamino-phenyl)-ethylamino]-2-(4-methoxy-phenyl)-propionamide | CHEMBL418867
TypeSmall organic molecule
Emp. Form.C29H38N4O7S
Mol. Mass.586.7
SMILESCOc1ccc(cc1)[C@](C)(NC[C@H](O)c1ccc(O)c(NS(C)(=O)=O)c1)C(=O)Nc1ccc(OCCN(C)C)cc1