Reaction Details
TargetBeta-3 adrenergic receptor
LigandBDBM50148527
Substrate/Competitorn/a
Meas. Tech.ChEBML_39051
Ki 1800±n/a nM
Citation Washburn, WNSun, CQBisacchi, GWu, GCheng, PTSher, PMRyono, DGavai, AVPoss, KGirotra, RNMcCann, PJMikkilineni, ABDejneka, TCWang, TCMerchant, ZMorella, MArbeeny, CMHarper, TWSlusarchyk, DASkwish, SRussell, ADAllen, GTTesfamariam, BFrohlich, BHAbboa-Offei, BECap, MWaldron, TLGeorge, RJYoung, DDickinson, KESeymour, AA BMS-201620: a selective beta 3 agonist. Bioorg Med Chem Lett14:3525-9 (2004) 
 
Beta-3 adrenergic receptor
Name:Beta-3 adrenergic receptor
Type:G Protein-Coupled Receptor (GPCR)
Mol. Mass.:43534.88
Organism:Homo sapiens (Human)
Description:n/a
Residue:408
BDBM50148527
NameBDBM50148527
Synonyms:3-[(S)-2-[2-Hydroxy-2-((R)-4-hydroxy-3-methanesulfonylamino-phenyl)-ethylamino]-2-(4-methoxy-phenyl)-propionylamino]-benzoic acid | CHEMBL261933
TypeSmall organic molecule
Emp. Form.C26H29N3O8S
Mol. Mass.543.589
SMILESCOc1ccc(cc1)[C@](C)(NC[C@H](O)c1ccc(O)c(NS(C)(=O)=O)c1)C(=O)Nc1cccc(c1)C(O)=O