Reaction Details
TargetAdenosine receptor A1
LigandBDBM50580517
Substrate/Competitorn/a
Meas. Tech.ChEMBL_2148501 (CHEMBL5032899)
Ki 19±n/a nM
Citation Hagenow, SAffini, APioli, EYHinz, SZhao, YPorras, GNamasivayam, VMüller, CELin, JSBezard, EStark, H Adenosine A J Med Chem64:8246-8262 (2021) 
 
Adenosine receptor A1
Name:Adenosine receptor A1
Type:G Protein-Coupled Receptor (GPCR)
Mol. Mass.:36520.92
Organism:Homo sapiens (Human)
Description:P30542
Residue:326
BDBM50580517
NameBDBM50580517
Synonyms:CHEMBL5084903
TypeSmall organic molecule
Emp. Form.C25H28N4O
Mol. Mass.400.516
SMILESNc1nc-2c(Cc3ccc(OCCCN4CCCCC4)cc-23)c(n1)-c1ccccc1