Reaction Details
TargetAdenosine receptor A1
LigandBDBM50580520
Substrate/Competitorn/a
Meas. Tech.ChEMBL_2148501 (CHEMBL5032899)
Ki 13±n/a nM
Citation Hagenow, SAffini, APioli, EYHinz, SZhao, YPorras, GNamasivayam, VMüller, CELin, JSBezard, EStark, H Adenosine A J Med Chem64:8246-8262 (2021) 
 
Adenosine receptor A1
Name:Adenosine receptor A1
Type:G Protein-Coupled Receptor (GPCR)
Mol. Mass.:36520.92
Organism:Homo sapiens (Human)
Description:P30542
Residue:326
BDBM50580520
NameBDBM50580520
Synonyms:CHEMBL5082920
TypeSmall organic molecule
Emp. Form.C24H24N4O2
Mol. Mass.400.473
SMILESNc1nc2-c3cc(OCCCN4CCCC4)ccc3C(=O)c2c(n1)-c1ccccc1