Reaction Details
TargetAdenosine receptor A1
LigandBDBM50580522
Substrate/Competitorn/a
Meas. Tech.ChEMBL_2148501 (CHEMBL5032899)
Ki 11±n/a nM
Citation Hagenow, SAffini, APioli, EYHinz, SZhao, YPorras, GNamasivayam, VMüller, CELin, JSBezard, EStark, H Adenosine A J Med Chem64:8246-8262 (2021) 
 
Adenosine receptor A1
Name:Adenosine receptor A1
Type:G Protein-Coupled Receptor (GPCR)
Mol. Mass.:36520.92
Organism:Homo sapiens (Human)
Description:P30542
Residue:326
BDBM50580522
NameBDBM50580522
Synonyms:CHEMBL5082650
TypeSmall organic molecule
Emp. Form.C25H26N4O2
Mol. Mass.414.4995
SMILESNc1nc2-c3cc(OCCCN4CCCCC4)ccc3C(=O)c2c(n1)-c1ccccc1