Reaction Details
TargetAdenosine receptor A1
LigandBDBM50202986
Substrate/Competitorn/a
Meas. Tech.ChEMBL_2148501 (CHEMBL5032899)
Ki 295±n/a nM
Citation Hagenow, SAffini, APioli, EYHinz, SZhao, YPorras, GNamasivayam, VMüller, CELin, JSBezard, EStark, H Adenosine A J Med Chem64:8246-8262 (2021) 
 
Adenosine receptor A1
Name:Adenosine receptor A1
Type:G Protein-Coupled Receptor (GPCR)
Mol. Mass.:36520.92
Organism:Homo sapiens (Human)
Description:P30542
Residue:326
BDBM50202986
NameBDBM50202986
Synonyms:2-furan-2-yl-7-(2-{4-[4-(2-methoxy-ethoxy)-phenyl]-piperazin-1-yl}-ethyl)-2,7-dihydro-3H-pyrazolo[4,3-e][1,2,4]triazolo[1,5-c]pyrimidin-5-ylamine 7-(2-(4-(2,4-difluorophenyl)piperazin-1-yl)ethyl)-2-(furan-2-yl)-7H-pyrazolo[4,3-e][1,2,4]triazolo[1,5-c]pyrimidin-5-amine SCH-420814 US11472811, Example Preladenant | preladenant
TypeSmall organic molecule
Emp. Form.C25H29N9O3
Mol. Mass.503.5563
SMILESCOCCOc1ccc(cc1)N1CCN(CCn2ncc3c2nc(N)n2nc(nc32)-c2ccco2)CC1