Reaction Details
TargetAdenosine receptor A2a
LigandBDBM50580514
Substrate/Competitorn/a
Meas. Tech.ChEMBL_2148502 (CHEMBL5032900)
Ki 941±n/a nM
Citation Hagenow, SAffini, APioli, EYHinz, SZhao, YPorras, GNamasivayam, VMüller, CELin, JSBezard, EStark, H Adenosine A J Med Chem64:8246-8262 (2021) 
 
Adenosine receptor A2a
Name:Adenosine receptor A2a
Type:G Protein-Coupled Receptor (GPCR)
Mol. Mass.:44716.46
Organism:Homo sapiens (Human)
Description:P29274
Residue:412
BDBM50580514
NameBDBM50580514
Synonyms:CHEMBL5093935
TypeSmall organic molecule
Emp. Form.C33H43N5O2
Mol. Mass.541.7268
SMILESNc1nc-2c(Cc3cc(OCCCN4CCCCC4)ccc-23)c(n1)-c1ccc(OCCCN2CCCCC2)cc1