Reaction Details
TargetAdenosine receptor A2a
LigandBDBM50580517
Substrate/Competitorn/a
Meas. Tech.ChEMBL_2148502 (CHEMBL5032900)
Ki 4.9±n/a nM
Citation Hagenow, SAffini, APioli, EYHinz, SZhao, YPorras, GNamasivayam, VMüller, CELin, JSBezard, EStark, H Adenosine A J Med Chem64:8246-8262 (2021) 
 
Adenosine receptor A2a
Name:Adenosine receptor A2a
Type:G Protein-Coupled Receptor (GPCR)
Mol. Mass.:44716.46
Organism:Homo sapiens (Human)
Description:P29274
Residue:412
BDBM50580517
NameBDBM50580517
Synonyms:CHEMBL5084903
TypeSmall organic molecule
Emp. Form.C25H28N4O
Mol. Mass.400.516
SMILESNc1nc-2c(Cc3ccc(OCCCN4CCCCC4)cc-23)c(n1)-c1ccccc1