Reaction Details
TargetAdenosine receptor A2a
LigandBDBM50580519
Substrate/Competitorn/a
Meas. Tech.ChEMBL_2148502 (CHEMBL5032900)
Ki 104±n/a nM
Citation Hagenow, SAffini, APioli, EYHinz, SZhao, YPorras, GNamasivayam, VMüller, CELin, JSBezard, EStark, H Adenosine A J Med Chem64:8246-8262 (2021) 
 
Adenosine receptor A2a
Name:Adenosine receptor A2a
Type:G Protein-Coupled Receptor (GPCR)
Mol. Mass.:44716.46
Organism:Homo sapiens (Human)
Description:P29274
Residue:412
BDBM50580519
NameBDBM50580519
Synonyms:CHEMBL5081556
TypeSmall organic molecule
Emp. Form.C24H24N4O2
Mol. Mass.400.473
SMILESNc1nc2-c3ccc(OCCCN4CCCC4)cc3C(=O)c2c(n1)-c1ccccc1