Reaction Details
TargetAdenosine receptor A2a
LigandBDBM50580521
Substrate/Competitorn/a
Meas. Tech.ChEMBL_2148502 (CHEMBL5032900)
Ki 142±n/a nM
Citation Hagenow, SAffini, APioli, EYHinz, SZhao, YPorras, GNamasivayam, VMüller, CELin, JSBezard, EStark, H Adenosine A J Med Chem64:8246-8262 (2021) 
 
Adenosine receptor A2a
Name:Adenosine receptor A2a
Type:G Protein-Coupled Receptor (GPCR)
Mol. Mass.:44716.46
Organism:Homo sapiens (Human)
Description:P29274
Residue:412
BDBM50580521
NameBDBM50580521
Synonyms:CHEMBL5087059
TypeSmall organic molecule
Emp. Form.C25H26N4O2
Mol. Mass.414.4995
SMILESNc1nc2-c3ccc(OCCCN4CCCCC4)cc3C(=O)c2c(n1)-c1ccccc1