Reaction Details
TargetAdenosine receptor A2b
LigandBDBM50580522
Substrate/Competitorn/a
Meas. Tech.ChEMBL_2148503 (CHEMBL5032901)
Ki 44±n/a nM
Citation Hagenow, SAffini, APioli, EYHinz, SZhao, YPorras, GNamasivayam, VMüller, CELin, JSBezard, EStark, H Adenosine A J Med Chem64:8246-8262 (2021) 
 
Adenosine receptor A2b
Name:Adenosine receptor A2b
Type:G Protein-Coupled Receptor (GPCR)
Mol. Mass.:36341.22
Organism:Homo sapiens (Human)
Description:n/a
Residue:332
BDBM50580522
NameBDBM50580522
Synonyms:CHEMBL5082650
TypeSmall organic molecule
Emp. Form.C25H26N4O2
Mol. Mass.414.4995
SMILESNc1nc2-c3cc(OCCCN4CCCCC4)ccc3C(=O)c2c(n1)-c1ccccc1