Reaction Details
TargetAdenosine receptor A3
LigandBDBM50580515
Substrate/Competitorn/a
Meas. Tech.ChEMBL_2148504 (CHEMBL5032902)
Ki 150±n/a nM
Citation Hagenow, SAffini, APioli, EYHinz, SZhao, YPorras, GNamasivayam, VMüller, CELin, JSBezard, EStark, H Adenosine A J Med Chem64:8246-8262 (2021) 
 
Adenosine receptor A3
Name:Adenosine receptor A3
Type:G Protein-Coupled Receptor (GPCR)
Mol. Mass.:36197.32
Organism:Homo sapiens (Human)
Description:P0DMS8
Residue:318
BDBM50580515
NameBDBM50580515
Synonyms:CHEMBL5088622
TypeSmall organic molecule
Emp. Form.C24H26N4O
Mol. Mass.386.4894
SMILESNc1nc-2c(Cc3ccc(OCCCN4CCCC4)cc-23)c(n1)-c1ccccc1