Reaction Details
TargetHistamine H3 receptor
LigandBDBM50580514
Substrate/Competitorn/a
Meas. Tech.ChEMBL_2148505 (CHEMBL5032903)
Ki 0.600000±n/a nM
Citation Hagenow, SAffini, APioli, EYHinz, SZhao, YPorras, GNamasivayam, VMüller, CELin, JSBezard, EStark, H Adenosine A J Med Chem64:8246-8262 (2021) 
 
Histamine H3 receptor
Name:Histamine H3 receptor
Type:G Protein-Coupled Receptor (GPCR)
Mol. Mass.:48691.47
Organism:Homo sapiens (Human)
Description:Binding assays were using CHO cells stably expressing hH3R receptors.
Residue:445
BDBM50580514
NameBDBM50580514
Synonyms:CHEMBL5093935
TypeSmall organic molecule
Emp. Form.C33H43N5O2
Mol. Mass.541.7268
SMILESNc1nc-2c(Cc3cc(OCCCN4CCCCC4)ccc-23)c(n1)-c1ccc(OCCCN2CCCCC2)cc1