Reaction Details
TargetHistamine H3 receptor
LigandBDBM50580517
Substrate/Competitorn/a
Meas. Tech.ChEMBL_2148505 (CHEMBL5032903)
Ki 4.5±n/a nM
Citation Hagenow, SAffini, APioli, EYHinz, SZhao, YPorras, GNamasivayam, VMüller, CELin, JSBezard, EStark, H Adenosine A J Med Chem64:8246-8262 (2021) 
 
Histamine H3 receptor
Name:Histamine H3 receptor
Type:G Protein-Coupled Receptor (GPCR)
Mol. Mass.:48691.47
Organism:Homo sapiens (Human)
Description:Binding assays were using CHO cells stably expressing hH3R receptors.
Residue:445
BDBM50580517
NameBDBM50580517
Synonyms:CHEMBL5084903
TypeSmall organic molecule
Emp. Form.C25H28N4O
Mol. Mass.400.516
SMILESNc1nc-2c(Cc3ccc(OCCCN4CCCCC4)cc-23)c(n1)-c1ccccc1