Reaction Details
TargetHistamine H3 receptor
LigandBDBM50580523
Substrate/Competitorn/a
Meas. Tech.ChEMBL_2148505 (CHEMBL5032903)
Ki 0.310000±n/a nM
Citation Hagenow, SAffini, APioli, EYHinz, SZhao, YPorras, GNamasivayam, VMüller, CELin, JSBezard, EStark, H Adenosine A J Med Chem64:8246-8262 (2021) 
 
Histamine H3 receptor
Name:Histamine H3 receptor
Type:G Protein-Coupled Receptor (GPCR)
Mol. Mass.:48691.47
Organism:Homo sapiens (Human)
Description:Binding assays were using CHO cells stably expressing hH3R receptors.
Residue:445
BDBM50580523
NameBDBM50580523
Synonyms:CHEMBL5093850
TypeSmall organic molecule
Emp. Form.C33H41N5O3
Mol. Mass.555.7103
SMILESNc1nc2-c3ccc(OCCCN4CCCCC4)cc3C(=O)c2c(n1)-c1ccc(OCCCN2CCCCC2)cc1