Reaction Details
TargetHistamine H3 receptor
LigandBDBM50580522
Substrate/Competitorn/a
Meas. Tech.ChEMBL_2148505 (CHEMBL5032903)
Ki 52±n/a nM
Citation Hagenow, SAffini, APioli, EYHinz, SZhao, YPorras, GNamasivayam, VMüller, CELin, JSBezard, EStark, H Adenosine A J Med Chem64:8246-8262 (2021) 
 
Histamine H3 receptor
Name:Histamine H3 receptor
Type:G Protein-Coupled Receptor (GPCR)
Mol. Mass.:48691.47
Organism:Homo sapiens (Human)
Description:Binding assays were using CHO cells stably expressing hH3R receptors.
Residue:445
BDBM50580522
NameBDBM50580522
Synonyms:CHEMBL5082650
TypeSmall organic molecule
Emp. Form.C25H26N4O2
Mol. Mass.414.4995
SMILESNc1nc2-c3cc(OCCCN4CCCCC4)ccc3C(=O)c2c(n1)-c1ccccc1