Reaction Details
TargetHistamine H3 receptor
LigandBDBM50458224
Substrate/Competitorn/a
Meas. Tech.ChEMBL_2148505 (CHEMBL5032903)
Ki 11±n/a nM
Citation Hagenow, SAffini, APioli, EYHinz, SZhao, YPorras, GNamasivayam, VMüller, CELin, JSBezard, EStark, H Adenosine A J Med Chem64:8246-8262 (2021) 
 
Histamine H3 receptor
Name:Histamine H3 receptor
Type:G Protein-Coupled Receptor (GPCR)
Mol. Mass.:48691.47
Organism:Homo sapiens (Human)
Description:Binding assays were using CHO cells stably expressing hH3R receptors.
Residue:445
BDBM50458224
NameBDBM50458224
Synonyms:CHEMBL2297871
TypeSmall organic molecule
Emp. Form.C18H25NO2
Mol. Mass.287.3966
SMILESO=C(C1CC1)c1ccc(OCCCN2CCCCC2)cc1