Reaction Details
TargetD(3) dopamine receptor
LigandBDBM50580515
Substrate/Competitorn/a
Meas. Tech.ChEMBL_2148518 (CHEMBL5032916)
Ki 290±n/a nM
Citation Hagenow, SAffini, APioli, EYHinz, SZhao, YPorras, GNamasivayam, VMüller, CELin, JSBezard, EStark, H Adenosine A J Med Chem64:8246-8262 (2021) 
 
D(3) dopamine receptor
Name:D(3) dopamine receptor
Type:PROTEIN
Mol. Mass.:44213.40
Organism:Homo sapiens
Description:ChEMBL_105671
Residue:400
BDBM50580515
NameBDBM50580515
Synonyms:CHEMBL5088622
TypeSmall organic molecule
Emp. Form.C24H26N4O
Mol. Mass.386.4894
SMILESNc1nc-2c(Cc3ccc(OCCCN4CCCC4)cc-23)c(n1)-c1ccccc1