Reaction Details
TargetD(3) dopamine receptor
LigandBDBM50580522
Substrate/Competitorn/a
Meas. Tech.ChEMBL_2148518 (CHEMBL5032916)
Ki 364±n/a nM
Citation Hagenow, SAffini, APioli, EYHinz, SZhao, YPorras, GNamasivayam, VMüller, CELin, JSBezard, EStark, H Adenosine A J Med Chem64:8246-8262 (2021) 
 
D(3) dopamine receptor
Name:D(3) dopamine receptor
Type:PROTEIN
Mol. Mass.:44213.40
Organism:Homo sapiens
Description:ChEMBL_105671
Residue:400
BDBM50580522
NameBDBM50580522
Synonyms:CHEMBL5082650
TypeSmall organic molecule
Emp. Form.C25H26N4O2
Mol. Mass.414.4995
SMILESNc1nc2-c3cc(OCCCN4CCCCC4)ccc3C(=O)c2c(n1)-c1ccccc1