Reaction Details
TargetMitogen-activated protein kinase 14
LigandBDBM50404281
Substrate/Competitorn/a
Meas. Tech.ChEBML_124496
IC50 18±n/a nM
Citation Revesz, LBlum, EDi Padova, FEBuhl, TFeifel, RGram, HHiestand, PManning, URucklin, G Novel p38 inhibitors with potent oral efficacy in several models of rheumatoid arthritis. Bioorg Med Chem Lett14:3595-9 (2004) 
 
Mitogen-activated protein kinase 14
Name:Mitogen-activated protein kinase 14
Type:Enzyme
Mol. Mass.:41281.22
Organism:Mus musculus (mouse)
Description:The full-length open reading frame of murine p38 alpha was cloned and expressed in E. coli.. Soluble murine p38R was extracted from cell pellets and purified using ion-exchange chromatography.
Residue:360
BDBM50404281
NameBDBM50404281
Synonyms:CHEMBL2111784
TypeSmall organic molecule
Emp. Form.C28H29FN4S
Mol. Mass.472.62
SMILESC[C@H](Nc1cc(ccn1)-c1sc(nc1-c1ccc(F)cc1)C1CCN(C)CC1)c1ccccc1