Reaction Details
TargetMitogen-activated protein kinase 14
LigandBDBM50148698
Substrate/Competitorn/a
Meas. Tech.ChEBML_124496
IC50 8±n/a nM
Citation Revesz, LBlum, EDi Padova, FEBuhl, TFeifel, RGram, HHiestand, PManning, URucklin, G Novel p38 inhibitors with potent oral efficacy in several models of rheumatoid arthritis. Bioorg Med Chem Lett14:3595-9 (2004) 
 
Mitogen-activated protein kinase 14
Name:Mitogen-activated protein kinase 14
Type:Enzyme
Mol. Mass.:41281.22
Organism:Mus musculus (mouse)
Description:The full-length open reading frame of murine p38 alpha was cloned and expressed in E. coli.. Soluble murine p38R was extracted from cell pellets and purified using ion-exchange chromatography.
Residue:360
BDBM50148698
NameBDBM50148698
Synonyms:CHEMBL333899 | Cyclohexyl-{4-[4-piperidin-4-yl-2-(3-trifluoromethyl-phenyl)-5H-imidazol-1-yl]-pyrimidin-2-yl}-amine
TypeSmall organic molecule
Emp. Form.C25H29F3N6
Mol. Mass.470.5332
SMILESFC(F)(F)c1cccc(c1)-c1nc(cn1-c1ccnc(NC2CCCCC2)n1)C1CCNCC1