Reaction Details
TargetMitogen-activated protein kinase 8
LigandBDBM50148690
Substrate/Competitorn/a
Meas. Tech.ChEBML_216676
IC50 150±n/a nM
Citation Revesz, LBlum, EDi Padova, FEBuhl, TFeifel, RGram, HHiestand, PManning, URucklin, G Novel p38 inhibitors with potent oral efficacy in several models of rheumatoid arthritis. Bioorg Med Chem Lett14:3595-9 (2004) 
 
Mitogen-activated protein kinase 8
Name:Mitogen-activated protein kinase 8
Type:Enzyme
Mol. Mass.:48297.57
Organism:Homo sapiens (Human)
Description:JNK-1 was purchased from Upstate Cell Signaling Solutions (formerly Upstate Biotechnology).
Residue:427
BDBM50148690
NameBDBM50148690
Synonyms:4-[5-(2-Cyclohexylamino-pyridin-4-yl)-4-(4-fluoro-phenyl)-oxazol-2-yl]-piperidin-4-ol | CHEMBL121405
TypeSmall organic molecule
Emp. Form.C25H29FN4O2
Mol. Mass.436.5218
SMILESOC1(CCNCC1)c1nc(c(o1)-c1ccnc(NC2CCCCC2)c1)-c1ccc(F)cc1