Reaction Details
TargetMitogen-activated protein kinase 14
LigandBDBM50148697
Substrate/Competitorn/a
Meas. Tech.ChEBML_124496
IC50 11±n/a nM
Citation Revesz, LBlum, EDi Padova, FEBuhl, TFeifel, RGram, HHiestand, PManning, URucklin, G Novel p38 inhibitors with potent oral efficacy in several models of rheumatoid arthritis. Bioorg Med Chem Lett14:3595-9 (2004) 
 
Mitogen-activated protein kinase 14
Name:Mitogen-activated protein kinase 14
Type:Enzyme
Mol. Mass.:41281.22
Organism:Mus musculus (mouse)
Description:The full-length open reading frame of murine p38 alpha was cloned and expressed in E. coli.. Soluble murine p38R was extracted from cell pellets and purified using ion-exchange chromatography.
Residue:360
BDBM50148697
NameBDBM50148697
Synonyms:4-{4-(4-Fluoro-phenyl)-5-[2-((S)-1-phenyl-ethylamino)-pyrimidin-4-yl]-oxazol-2-yl}-1-methyl-piperidin-4-ol | CHEMBL120085
TypeSmall organic molecule
Emp. Form.C27H28FN5O2
Mol. Mass.473.5419
SMILESC[C@H](Nc1nccc(n1)-c1oc(nc1-c1ccc(F)cc1)C1(O)CCN(C)CC1)c1ccccc1