Reaction Details
TargetMitogen-activated protein kinase 14
LigandBDBM50148690
Substrate/Competitorn/a
Meas. Tech.ChEBML_124496
IC50 15±n/a nM
Citation Revesz, LBlum, EDi Padova, FEBuhl, TFeifel, RGram, HHiestand, PManning, URucklin, G Novel p38 inhibitors with potent oral efficacy in several models of rheumatoid arthritis. Bioorg Med Chem Lett14:3595-9 (2004) 
 
Mitogen-activated protein kinase 14
Name:Mitogen-activated protein kinase 14
Type:Enzyme
Mol. Mass.:41281.22
Organism:Mus musculus (mouse)
Description:The full-length open reading frame of murine p38 alpha was cloned and expressed in E. coli.. Soluble murine p38R was extracted from cell pellets and purified using ion-exchange chromatography.
Residue:360
BDBM50148690
NameBDBM50148690
Synonyms:4-[5-(2-Cyclohexylamino-pyridin-4-yl)-4-(4-fluoro-phenyl)-oxazol-2-yl]-piperidin-4-ol | CHEMBL121405
TypeSmall organic molecule
Emp. Form.C25H29FN4O2
Mol. Mass.436.5218
SMILESOC1(CCNCC1)c1nc(c(o1)-c1ccnc(NC2CCCCC2)c1)-c1ccc(F)cc1