Reaction Details
TargetHistone acetyltransferase KAT2A
LigandBDBM50580965
Substrate/Competitorn/a
Meas. Tech.ChEMBL_2149513 (CHEMBL5033911)
IC50>20000±n/a nM
Citation Ding, HPei, YLi, YXu, WMei, LHou, ZGuang, YCao, LLi, PCao, HBian, JChen, KLuo, CZhou, BZhang, TLi, ZYang, Y Design, synthesis and biological evaluation of a novel spiro oxazolidinedione as potent p300/CBP HAT inhibitor for the treatment of ovarian cancer. Bioorg Med Chem52:0 (2021) 
 
Histone acetyltransferase KAT2A
Name:Histone acetyltransferase KAT2A
Type:PROTEIN
Mol. Mass.:93956.22
Organism:Homo sapiens (Human)
Description:ChEMBL_100876
Residue:837
BDBM50580965
NameBDBM50580965
Synonyms:CHEMBL5090239
TypeSmall organic molecule
Emp. Form.C27H27FN4O6
Mol. Mass.522.5249
SMILESCNC(=O)Nc1ccc2c(CC[C@@]22OC(=O)N(CC(=O)N3Cc4cc(F)ccc4OC[C@H]3C3CC3)C2=O)c1