Reaction Details
TargetEstrogen receptor
LigandBDBM50149494
Substrate/Competitorn/a
Meas. Tech.ChEMBL_304574 (CHEMBL831071)
IC50 0.90±n/a nM
Citation Blizzard, TADiNinno, FMorgan, JDChen, HYWu, JYGude, CKim, SChan, WBirzin, ETTien Yang, YPai, LYZhang, ZHayes, ECDaSilva, CATang, WRohrer, SPSchaeffer, JMHammond, ML Estrogen receptor ligands. Part 7: Dihydrobenzoxathiin SERAMs with bicyclic amine side chains. Bioorg Med Chem Lett14:3861-4 (2004) 
 
Estrogen receptor
Name:Estrogen receptor
Type:Protein
Mol. Mass.:66230.44
Organism:Homo sapiens (Human)
Description:P03372
Residue:595
BDBM50149494
NameBDBM50149494
Synonyms:(2S,3R)-2-{4-[2-(7-Aza-bicyclo[2.2.1]hept-7-yl)-ethoxy]-phenyl}-3-(4-hydroxy-phenyl)-2,3-dihydro-benzo[1,4]oxathiin-6-ol | CHEMBL368688
TypeSmall organic molecule
Emp. Form.C28H29NO4S
Mol. Mass.475.599
SMILESOc1ccc(cc1)[C@H]1Sc2cc(O)ccc2O[C@H]1c1ccc(OCCN2C3CCC2CC3)cc1