Reaction Details
TargetEstrogen receptor beta
LigandBDBM50149497
Substrate/Competitorn/a
Meas. Tech.ChEMBL_304572 (CHEMBL831070)
IC50 136±n/a nM
Citation Blizzard, TADiNinno, FMorgan, JDChen, HYWu, JYGude, CKim, SChan, WBirzin, ETTien Yang, YPai, LYZhang, ZHayes, ECDaSilva, CATang, WRohrer, SPSchaeffer, JMHammond, ML Estrogen receptor ligands. Part 7: Dihydrobenzoxathiin SERAMs with bicyclic amine side chains. Bioorg Med Chem Lett14:3861-4 (2004) 
 
Estrogen receptor beta
Name:Estrogen receptor beta
Type:Protein
Mol. Mass.:59238.43
Organism:Homo sapiens (Human)
Description:Q92731
Residue:530
BDBM50149497
NameBDBM50149497
Synonyms:(2S,3R)-2-{4-[2-(3-Aza-bicyclo[3.1.0]hex-3-yl)-ethoxy]-phenyl}-3-(4-hydroxy-phenyl)-2,3-dihydro-benzo[1,4]oxathiin-6-ol | CHEMBL184202
TypeSmall organic molecule
Emp. Form.C27H27NO4S
Mol. Mass.461.573
SMILESOc1ccc(cc1)[C@H]1Sc2cc(O)ccc2O[C@H]1c1ccc(OCCN2CC3CC3C2)cc1