Reaction Details
TargetEstrogen receptor beta
LigandBDBM50149491
Substrate/Competitorn/a
Meas. Tech.ChEMBL_304572 (CHEMBL831070)
IC50 18±n/a nM
Citation Blizzard, TADiNinno, FMorgan, JDChen, HYWu, JYGude, CKim, SChan, WBirzin, ETTien Yang, YPai, LYZhang, ZHayes, ECDaSilva, CATang, WRohrer, SPSchaeffer, JMHammond, ML Estrogen receptor ligands. Part 7: Dihydrobenzoxathiin SERAMs with bicyclic amine side chains. Bioorg Med Chem Lett14:3861-4 (2004) 
 
Estrogen receptor beta
Name:Estrogen receptor beta
Type:Protein
Mol. Mass.:59238.43
Organism:Homo sapiens (Human)
Description:Q92731
Residue:530
BDBM50149491
NameBDBM50149491
Synonyms:(2S,3R)-2-{4-[(3aS,6aR)-2-(Hexahydro-cyclopenta[c]pyrrol-2-yl)-ethoxy]-phenyl}-3-(4-hydroxy-phenyl)-2,3-dihydro-benzo[1,4]oxathiin-6-ol | CHEMBL433769
TypeSmall organic molecule
Emp. Form.C29H31NO4S
Mol. Mass.489.626
SMILESOc1ccc(cc1)[C@H]1Sc2cc(O)ccc2O[C@H]1c1ccc(OCCN2C[C@@H]3CCC[C@@H]3C2)cc1