Reaction Details
Target5-hydroxytryptamine receptor 7
LigandBDBM50150424
Substrate/Competitorn/a
Meas. Tech.ChEMBL_302554 (CHEMBL839517)
Ki 5±n/a nM
Citation Denhart, DJPurandare, AVCatt, JDKing, HDGao, ADeskus, JAPoss, MAStark, ADTorrente, JRJohnson, GMattson, RJ Diaminopyrimidine and diaminopyridine 5-HT7 ligands. Bioorg Med Chem Lett14:4249-52 (2004) 
 
5-hydroxytryptamine receptor 7
Name:5-hydroxytryptamine receptor 7
Type:G Protein-Coupled Receptor (GPCR)
Mol. Mass.:53573.08
Organism:Homo sapiens (Human)
Description:P34969
Residue:479
BDBM50150424
NameBDBM50150424
Synonyms:CHEMBL182943 | N-[2-(4-Fluoro-phenoxy)-ethyl]-N''-((S)-1-phenyl-ethyl)-pyrimidine-4,6-diamine
TypeSmall organic molecule
Emp. Form.C20H21FN4O
Mol. Mass.352.4053
SMILESC[C@H](Nc1cc(NCCOc2ccc(F)cc2)ncn1)c1ccccc1