Reaction Details
Target5-hydroxytryptamine receptor 7
LigandBDBM50150434
Substrate/Competitorn/a
Meas. Tech.ChEMBL_302554 (CHEMBL839517)
Ki>1000±n/a nM
Citation Denhart, DJPurandare, AVCatt, JDKing, HDGao, ADeskus, JAPoss, MAStark, ADTorrente, JRJohnson, GMattson, RJ Diaminopyrimidine and diaminopyridine 5-HT7 ligands. Bioorg Med Chem Lett14:4249-52 (2004) 
 
5-hydroxytryptamine receptor 7
Name:5-hydroxytryptamine receptor 7
Type:G Protein-Coupled Receptor (GPCR)
Mol. Mass.:53573.08
Organism:Homo sapiens (Human)
Description:P34969
Residue:479
BDBM50150434
NameBDBM50150434
Synonyms:CHEMBL360658 | N-Phenethyl-N''-((S)-1-phenyl-ethyl)-pyridine-2,6-diamine
TypeSmall organic molecule
Emp. Form.C21H23N3
Mol. Mass.317.4274
SMILESC[C@H](Nc1cccc(NCCc2ccccc2)n1)c1ccccc1