Reaction Details
TargetATP-sensitive inward rectifier potassium channel 1
LigandBDBM155921
Substrate/Competitorn/a
Meas. Tech.ChEMBL_2155247 (CHEMBL5039907)
IC50 9.0±n/a nM
Citation Jiang, JDing, FXZhou, XBateman, TJDong, SGu, XKeh deJesus, RPio, BTang, HChobanian, HRLevorse, DHu, MThomas-Fowlkes, BMargulis, MKoehler, MWeinglass, AGibson, JHoule, KYudkovitz, JHampton, CPai, LYSamuel, KCutarelli, TSullivan, KParmee, ERDavies, IPasternak, A Discovery of MK-8153, a Potent and Selective ROMK Inhibitor and Novel Diuretic/Natriuretic. J Med Chem64:7691-7701 (2021) 
 
ATP-sensitive inward rectifier potassium channel 1
Name:ATP-sensitive inward rectifier potassium channel 1
Type:Enzyme Catalytic Domain
Mol. Mass.:44809.08
Organism:Homo sapiens (Human)
Description:gi_223460826
Residue:391
BDBM155921
NameBDBM155921
Synonyms:US9018211, 2A
TypeSmall organic molecule
Emp. Form.C26H30N2O6
Mol. Mass.466.5262
SMILESCc1c2COC(=O)c2ccc1[C@@H](O)CN1CCN(C[C@H](O)c2ccc3C(=O)OCc3c2C)CC1