Reaction Details
TargetPotassium voltage-gated channel subfamily H member 2
LigandBDBM155921
Substrate/Competitorn/a
Meas. Tech.ChEMBL_2155248 (CHEMBL5039908)
IC50 22000±n/a nM
Citation Jiang, JDing, FXZhou, XBateman, TJDong, SGu, XKeh deJesus, RPio, BTang, HChobanian, HRLevorse, DHu, MThomas-Fowlkes, BMargulis, MKoehler, MWeinglass, AGibson, JHoule, KYudkovitz, JHampton, CPai, LYSamuel, KCutarelli, TSullivan, KParmee, ERDavies, IPasternak, A Discovery of MK-8153, a Potent and Selective ROMK Inhibitor and Novel Diuretic/Natriuretic. J Med Chem64:7691-7701 (2021) 
 
Potassium voltage-gated channel subfamily H member 2
Name:Potassium voltage-gated channel subfamily H member 2
Type:Multi-pass membrane protein
Mol. Mass.:126672.65
Organism:Homo sapiens (Human)
Description:Q12809
Residue:1159
BDBM155921
NameBDBM155921
Synonyms:US9018211, 2A
TypeSmall organic molecule
Emp. Form.C26H30N2O6
Mol. Mass.466.5262
SMILESCc1c2COC(=O)c2ccc1[C@@H](O)CN1CCN(C[C@H](O)c2ccc3C(=O)OCc3c2C)CC1