Reaction Details
TargetRetinoic acid receptor RXR-alpha
LigandBDBM31892
Substrate/Competitorn/a
Meas. Tech.ChEMBL_306707 (CHEMBL832609)
IC50 29±n/a nM
Citation Cavasotto, CNLiu, GJames, SYHobbs, PDPeterson, VJBhattacharya, AAKolluri, SKZhang, XKLeid, MAbagyan, RLiddington, RCDawson, MI Determinants of retinoid X receptor transcriptional antagonism. J Med Chem47:4360-72 (2004) 
 
Retinoic acid receptor RXR-alpha
Name:Retinoic acid receptor RXR-alpha
Type:PROTEIN
Mol. Mass.:50820.38
Organism:Homo sapiens (Human)
Description:ChEMBL_1456363
Residue:462
BDBM31892
NameBDBM31892
Synonyms:9-cis retinoic acid CHEMBL705 alitretinoin
TypeSmall organic molecule
Emp. Form.C20H28O2
Mol. Mass.300.4351
SMILESC\C(\C=C\C1=C(C)CCCC1(C)C)=C\C=C\C(\C)=C\C(O)=O