Reaction Details
TargetRetinoic acid receptor RXR-alpha
LigandBDBM50151227
Substrate/Competitorn/a
Meas. Tech.ChEMBL_306707 (CHEMBL832609)
IC50 270±n/a nM
Citation Cavasotto, CNLiu, GJames, SYHobbs, PDPeterson, VJBhattacharya, AAKolluri, SKZhang, XKLeid, MAbagyan, RLiddington, RCDawson, MI Determinants of retinoid X receptor transcriptional antagonism. J Med Chem47:4360-72 (2004) 
 
Retinoic acid receptor RXR-alpha
Name:Retinoic acid receptor RXR-alpha
Type:PROTEIN
Mol. Mass.:50820.38
Organism:Homo sapiens (Human)
Description:ChEMBL_1456363
Residue:462
BDBM50151227
NameBDBM50151227
Synonyms:4-[(3-Butoxy-5,5,8,8-tetramethyl-5,6,7,8-tetrahydro-naphthalen-2-yl)-cyclopropylidene-methyl]-benzoic acid | CHEMBL188581
TypeSmall organic molecule
Emp. Form.C29H36O3
Mol. Mass.432.5943
SMILES[#6]-[#6]-[#6]-[#6]-[#8]-c1cc2c(cc1\[#6](=[#6]-1\[#6]-[#6]-1)-c1ccc(cc1)-[#6](-[#8])=O)C([#6])([#6])[#6]-[#6]C2([#6])[#6]