Reaction Details
TargetB1 bradykinin receptor
LigandBDBM50151886
Substrate/Competitorn/a
Meas. Tech.ChEMBL_302842 (CHEMBL827887)
Ki 10±n/a nM
Citation Ritchie, TJDziadulewicz, EKCulshaw, AJMüller, WBurgess, GMBloomfield, GCDrake, GSDunstan, ARBeattie, DHughes, GAGanju, PMcIntyre, PBevan, SJDavis, CYaqoob, M Potent and orally bioavailable non-peptide antagonists at the human bradykinin B(1) receptor based on a 2-alkylamino-5-sulfamoylbenzamide core. J Med Chem47:4642-4 (2004) 
 
B1 bradykinin receptor
Name:B1 bradykinin receptor
Type:Enzyme
Mol. Mass.:40508.87
Organism:Homo sapiens (Human)
Description:P46663
Residue:353
BDBM50151886
NameBDBM50151886
Synonyms:CHEMBL181695 | {2-(2,2-Diphenyl-ethylamino)-5-[4-(4-isopropyl-piperazine-1-carbonyl)-piperidine-1-sulfonyl]-phenyl}-morpholin-4-yl-methanone
TypeSmall organic molecule
Emp. Form.C38H49N5O5S
Mol. Mass.687.891
SMILESCC(C)N1CCN(CC1)C(=O)C1CCN(CC1)S(=O)(=O)c1ccc(NCC(c2ccccc2)c2ccccc2)c(c1)C(=O)N1CCOCC1