Reaction Details
TargetB1 bradykinin receptor
LigandBDBM50151894
Substrate/Competitorn/a
Meas. Tech.ChEMBL_302842 (CHEMBL827887)
Ki 10±n/a nM
Citation Ritchie, TJDziadulewicz, EKCulshaw, AJMüller, WBurgess, GMBloomfield, GCDrake, GSDunstan, ARBeattie, DHughes, GAGanju, PMcIntyre, PBevan, SJDavis, CYaqoob, M Potent and orally bioavailable non-peptide antagonists at the human bradykinin B(1) receptor based on a 2-alkylamino-5-sulfamoylbenzamide core. J Med Chem47:4642-4 (2004) 
 
B1 bradykinin receptor
Name:B1 bradykinin receptor
Type:Enzyme
Mol. Mass.:40508.87
Organism:Homo sapiens (Human)
Description:P46663
Residue:353
BDBM50151894
NameBDBM50151894
Synonyms:1-[4-(2,2-Diphenyl-ethylamino)-3-nitro-benzenesulfonyl]-piperidine-4-carboxylic acid bis-(3-dimethylamino-propyl)-amide | CHEMBL366294
TypeSmall organic molecule
Emp. Form.C36H50N6O5S
Mol. Mass.678.884
SMILESCN(C)CCCN(CCCN(C)C)C(=O)C1CCN(CC1)S(=O)(=O)c1ccc(NCC(c2ccccc2)c2ccccc2)c(c1)[N+]([O-])=O