Reaction Details
TargetPro-cathepsin H
LigandBDBM50152527
Substrate/Competitorn/a
Meas. Tech.ChEMBL_306357 (CHEMBL828234)
IC50>5000±n/a nM
Citation Barrett, DGCatalano, JGDeaton, DNHassell, AMLong, STMiller, ABMiller, LRShewchuk, LMWells-Knecht, KJWillard, DHWright, LL Potent and selective P2-P3 ketoamide inhibitors of cathepsin K with good pharmacokinetic properties via favorable P1', P1, and/or P3 substitutions. Bioorg Med Chem Lett14:4897-902 (2004) 
 
Pro-cathepsin H
Name:Pro-cathepsin H
Type:PROTEIN
Mol. Mass.:37402.31
Organism:Homo sapiens (Human)
Description:ChEMBL_1459870
Residue:335
BDBM50152527
NameBDBM50152527
Synonyms:(1-benzylcyclobutyl)methyl(S)-1,2-dioxo-1-((R)-1-phenylethylamino)heptan-3-ylcarbamate [(S)-1-((R)-1-Phenyl-ethylaminooxalyl)-pentyl]-carbamic acid 1-benzyl-cyclobutylmethyl ester
TypeSmall organic molecule
Emp. Form.C28H36N2O4
Mol. Mass.464.5964
SMILESCCCC[C@H](NC(=O)OCC1(Cc2ccccc2)CCC1)C(=O)C(=O)N[C@H](C)c1ccccc1