Reaction Details
TargetAdenosine receptor A2b
LigandBDBM50583640
Substrate/Competitorn/a
Meas. Tech.ChEMBL_2157921 (CHEMBL5042671)
Kd 7.8±n/a nM
Citation Comeo, ETrinh, PNguyen, ATNowell, CJKindon, NDSoave, MStoddart, LAWhite, JMHill, SJKellam, BHalls, MLMay, LTScammells, PJ Development and Application of Subtype-Selective Fluorescent Antagonists for the Study of the Human Adenosine A J Med Chem64:6670-6695 (2021) 
 
Adenosine receptor A2b
Name:Adenosine receptor A2b
Type:G Protein-Coupled Receptor (GPCR)
Mol. Mass.:36341.22
Organism:Homo sapiens (Human)
Description:n/a
Residue:332
BDBM50583640
NameBDBM50583640
Synonyms:CHEMBL5075285
TypeSmall organic molecule
Emp. Form.C57H70BF2N11O8S
Mol. Mass.1118.107
SMILESCCCn1c2nc([nH]c2c(=O)n(CCC)c1=O)C12CCC(CC1)(CC2)C(=O)NCCNC(=O)CCNC(=O)CCNC(=O)CCCCCNC(=O)COc1ccc(\C=C\C2=[N+]3C(C=C2)=Cc2ccc(-c4cccs4)n2[B-]3(F)F)cc1