Reaction Details
TargetAdenosine receptor A2b
LigandBDBM50583644
Substrate/Competitorn/a
Meas. Tech.ChEMBL_2157921 (CHEMBL5042671)
Kd 55±n/a nM
Citation Comeo, ETrinh, PNguyen, ATNowell, CJKindon, NDSoave, MStoddart, LAWhite, JMHill, SJKellam, BHalls, MLMay, LTScammells, PJ Development and Application of Subtype-Selective Fluorescent Antagonists for the Study of the Human Adenosine A J Med Chem64:6670-6695 (2021) 
 
Adenosine receptor A2b
Name:Adenosine receptor A2b
Type:G Protein-Coupled Receptor (GPCR)
Mol. Mass.:36341.22
Organism:Homo sapiens (Human)
Description:n/a
Residue:332
BDBM50583644
NameBDBM50583644
Synonyms:CHEMBL5080679
TypeSmall organic molecule
Emp. Form.C63H72BF2N11O8S
Mol. Mass.1192.187
SMILESCCCn1c(=O)n(CCCNC(=O)c2ccc(cc2)C(=O)NCCNC(=O)CCNC(=O)CCCCCNC(=O)COc2ccc(\C=C\C3=[N+]4C(C=C3)=Cc3ccc(-c5cccs5)n3[B-]4(F)F)cc2)c2nc([nH]c2c1=O)C12CC3CC(CC(C3)C1)C2