Reaction Details
TargetAdenosine receptor A1
LigandBDBM50583641
Substrate/Competitorn/a
Meas. Tech.ChEMBL_2157929 (CHEMBL5042679)
Ki 0.707946±n/a nM
Citation Comeo, ETrinh, PNguyen, ATNowell, CJKindon, NDSoave, MStoddart, LAWhite, JMHill, SJKellam, BHalls, MLMay, LTScammells, PJ Development and Application of Subtype-Selective Fluorescent Antagonists for the Study of the Human Adenosine A J Med Chem64:6670-6695 (2021) 
 
Adenosine receptor A1
Name:Adenosine receptor A1
Type:G Protein-Coupled Receptor (GPCR)
Mol. Mass.:36520.92
Organism:Homo sapiens (Human)
Description:P30542
Residue:326
BDBM50583641
NameBDBM50583641
Synonyms:CHEMBL5086197
TypeSmall organic molecule
Emp. Form.C60H80N10O12S2
Mol. Mass.1197.467
SMILESCCCn1c2nc([nH]c2c(=O)n(CCC)c1=O)C12CCC(CC1)(CC2)C(=O)NCCNC(=O)CCNC(=O)CCNC(=O)CCCCC[N+]1=C(\C=C\C=C\C=C2\N(C)c3ccc(cc3C2(C)C)S(O)(=O)=O)C(C)(C)c2cc(ccc12)S([O-])(=O)=O